Reaction Details
TargetNeutrophil collagenase
LigandBDBM50062303
Substrate/Competitorn/a
Meas. Tech.ChEMBL_105205 (CHEMBL713844)
Ki 0.29±n/a nM
Citation Levy, DELapierre, FLiang, WYe, WLange, CWLi, XGrobelny, DCasabonne, MTyrrell, DHolme, KNadzan, AGalardy, RE Matrix metalloproteinase inhibitors: a structure-activity study. J Med Chem41:199-223 (1998) 
 
Neutrophil collagenase
Name:Neutrophil collagenase
Type:Enzyme
Mol. Mass.:53413.48
Organism:Homo sapiens (Human)
Description:P22894
Residue:467
BDBM50062303
NameBDBM50062303
Synonyms:(R)-N*4*-Hydroxy-N*1*-{(S)-2-(1H-indol-3-yl)-1-[(pyridin-4-ylmethyl)-carbamoyl]-ethyl}-2-isobutyl-succinamide | CHEMBL310249
TypeSmall organic molecule
Emp. Form.C25H31N5O4
Mol. Mass.465.5447
SMILESCC(C)C[C@H](CC(=O)NO)C(=O)N[C@@H](Cc1c[nH]c2ccccc12)C(=O)NCc1ccncc1