Reaction Details
TargetNeutrophil collagenase
LigandBDBM50062324
Substrate/Competitorn/a
Meas. Tech.ChEMBL_105205 (CHEMBL713844)
Ki 0.53±n/a nM
Citation Levy, DELapierre, FLiang, WYe, WLange, CWLi, XGrobelny, DCasabonne, MTyrrell, DHolme, KNadzan, AGalardy, RE Matrix metalloproteinase inhibitors: a structure-activity study. J Med Chem41:199-223 (1998) 
 
Neutrophil collagenase
Name:Neutrophil collagenase
Type:Enzyme
Mol. Mass.:53413.48
Organism:Homo sapiens (Human)
Description:P22894
Residue:467
BDBM50062324
NameBDBM50062324
Synonyms:(2R,3S)-2,N*1*-Dihydroxy-3-isobutyl-N*4*-((R)-3-methyl-1-methylcarbamoyl-butyl)-succinamide | CHEMBL70398
TypeSmall organic molecule
Emp. Form.C15H29N3O5
Mol. Mass.331.4079
SMILESCNC(=O)[C@@H](CC(C)C)NC(=O)[C@H](CC(C)C)[C@H](O)C(=O)NO