Reaction Details
TargetNeutrophil collagenase
LigandBDBM50062343
Substrate/Competitorn/a
Meas. Tech.ChEMBL_105205 (CHEMBL713844)
Ki 0.63±n/a nM
Citation Levy, DELapierre, FLiang, WYe, WLange, CWLi, XGrobelny, DCasabonne, MTyrrell, DHolme, KNadzan, AGalardy, RE Matrix metalloproteinase inhibitors: a structure-activity study. J Med Chem41:199-223 (1998) 
 
Neutrophil collagenase
Name:Neutrophil collagenase
Type:Enzyme
Mol. Mass.:53413.48
Organism:Homo sapiens (Human)
Description:P22894
Residue:467
BDBM50062343
NameBDBM50062343
Synonyms:(R)-N*1*-((R)-1-Benzylcarbamoyl-2-pyridin-3-yl-ethyl)-N*4*-hydroxy-2-isobutyl-succinamide | CHEMBL69506
TypeSmall organic molecule
Emp. Form.C23H30N4O4
Mol. Mass.426.5087
SMILESCC(C)C[C@H](CC(=O)NO)C(=O)N[C@H](Cc1cccnc1)C(=O)NCc1ccccc1