Reaction Details
TargetcAMP-specific 3',5'-cyclic phosphodiesterase 4D
LigandBDBM14775
Substrate/Competitorn/a
Meas. Tech.ChEMBL_155179 (CHEMBL761826)
IC50 0.8±n/a nM
Citation Kleinman, EFCampbell, EGiordano, LACohan, VLJenkinson, THCheng, JBShirley, JTPettipher, ERSalter, EDHibbs, TADiCapua, FMBordner, J Striking effect of hydroxamic acid substitution on the phosphodiesterase type 4 (PDE4) and TNF alpha inhibitory activity of two series of rolipram analogues: implications for a new active site model of PDE4. J Med Chem41:266-70 (1998) 
 
cAMP-specific 3',5'-cyclic phosphodiesterase 4D
Name:cAMP-specific 3',5'-cyclic phosphodiesterase 4D
Type:Protein
Mol. Mass.:91092.69
Organism:Homo sapiens (Human)
Description:Q08499
Residue:809
BDBM14775
NameBDBM14775
Synonyms:3-(cyclopentyloxy)-N-(3,5-dichloropyridin-4-yl)-4-methoxybenzamide CHEMBL42126 Piclamilast | RPR-73401
TypeSmall organic molecule
Emp. Form.C18H18Cl2N2O3
Mol. Mass.381.253
SMILESCOc1ccc(cc1OC1CCCC1)C(=O)Nc1c(Cl)cncc1Cl