Reaction Details
TargetATP-binding cassette sub-family C member 9/ATP-sensitive inward rectifier potassium channel 11
LigandBDBM50062393
Substrate/Competitorn/a
Meas. Tech.ChEMBL_46128 (CHEMBL660002)
Ki 350±n/a nM
Citation Atwal, KSGrover, GJLodge, NJNormandin, DETraeger, SCSleph, PGCohen, RBBryson, CCDickinson, KE Binding of ATP-sensitive potassium channel (KATP) openers to cardiac membranes: correlation of binding affinities with cardioprotective and smooth muscle relaxing potencies. J Med Chem41:271-5 (1998) 
 
ATP-binding cassette sub-family C member 9/ATP-sensitive inward rectifier potassium channel 11
Name:ATP-binding cassette sub-family C member 9/ATP-sensitive inward rectifier potassium channel 11
Type:n/a
Mol. Mass.:n/a
Description:ASSAY_ID of EBI is 46128
Components:This complex has 2 components.
Component 1
Name:ATP-binding cassette sub-family C member 9
Synonyms:ABCC9 ATP-binding cassette transporter sub-family C member 9 Sulfonylurea receptor 2 | Sulfonylurea receptor 2, Kir6.2
Type:PROTEIN
Mol. Mass.:174236.59
Organism:Homo sapiens (Human)
Description:ChEMBL_495672
Residue:1549
Component 2
Name:ATP-sensitive inward rectifier potassium channel 11
Synonyms:ATP-sensitive inward rectifier potassium channel 11 Inward rectifier K(+) channel Kir6.2 KCNJ11 Potassium channel, inwardly rectifying, subfamily J, member 11 Sulfonylurea receptor 2, Kir6.2
Type:Enzyme Catalytic Domain
Mol. Mass.:43549.41
Organism:Homo sapiens (Human)
Description:Potassium channel (ATP modulatory) 0 0::Q14654
Residue:390
BDBM50062393
NameBDBM50062393
Synonyms:3-cyanoimino(1,2,2-trimethylpropylamino)methylaminobenzonitrile N''-cyano-N-(3-cyanophenyl)-N'-(1,2,2-trimethylpropyl)guanidine
TypeSmall organic molecule
Emp. Form.C15H19N5
Mol. Mass.269.3449
SMILESCC(NC(Nc1cccc(c1)C#N)=NC#N)C(C)(C)C