Reaction Details
TargetProgesterone receptor
LigandBDBM50062412
Substrate/Competitorn/a
Meas. Tech.ChEMBL_159557 (CHEMBL765845)
Ki 13±n/a nM
Citation Zhi, LTegley, CMKallel, EAMarschke, KBMais, DEGottardis, MMJones, TK 5-Aryl-1,2-dihydrochromeno[3,4-f]quinolines: a novel class of nonsteroidal human progesterone receptor agonists. J Med Chem41:291-302 (1998) 
 
Progesterone receptor
Name:Progesterone receptor
Type:Protein
Mol. Mass.:98979.52
Organism:Homo sapiens (Human)
Description:P06401
Residue:933
BDBM50062412
NameBDBM50062412
Synonyms:5-(4-Methoxy-phenyl)-2,2,4-trimethyl-2,5-dihydro-1H-6-oxa-1-aza-chrysene | CHEMBL103468
TypeSmall organic molecule
Emp. Form.C26H25NO2
Mol. Mass.383.4822
SMILESCOc1ccc(cc1)C1Oc2ccccc2-c2ccc3NC(C)(C)C=C(C)c3c12