Reaction Details
TargetGlucocorticoid receptor
LigandBDBM50062417
Substrate/Competitorn/a
Meas. Tech.ChEMBL_71406 (CHEMBL680192)
Ki 152±n/a nM
Citation Zhi, LTegley, CMKallel, EAMarschke, KBMais, DEGottardis, MMJones, TK 5-Aryl-1,2-dihydrochromeno[3,4-f]quinolines: a novel class of nonsteroidal human progesterone receptor agonists. J Med Chem41:291-302 (1998) 
 
Glucocorticoid receptor
Name:Glucocorticoid receptor
Type:Enzyme
Mol. Mass.:85656.87
Organism:Homo sapiens (Human)
Description:P04150
Residue:777
BDBM50062417
NameBDBM50062417
Synonyms:5-(4-Chloro-phenyl)-2,2,4-trimethyl-2,5-dihydro-1H-6-oxa-1-aza-chrysene | CHEMBL286595
TypeSmall organic molecule
Emp. Form.C25H22ClNO
Mol. Mass.387.901
SMILESCC1=CC(C)(C)Nc2ccc3-c4ccccc4OC(c4ccc(Cl)cc4)c3c12