Reaction Details
TargetProgesterone receptor
LigandBDBM50062407
Substrate/Competitorn/a
Meas. Tech.ChEMBL_159557 (CHEMBL765845)
Ki 1.1±n/a nM
Citation Zhi, LTegley, CMKallel, EAMarschke, KBMais, DEGottardis, MMJones, TK 5-Aryl-1,2-dihydrochromeno[3,4-f]quinolines: a novel class of nonsteroidal human progesterone receptor agonists. J Med Chem41:291-302 (1998) 
 
Progesterone receptor
Name:Progesterone receptor
Type:Protein
Mol. Mass.:98979.52
Organism:Homo sapiens (Human)
Description:P06401
Residue:933
BDBM50062407
NameBDBM50062407
Synonyms:5-(3-Bromo-phenyl)-2,2,4-trimethyl-2,5-dihydro-1H-6-oxa-1-aza-chrysene | CHEMBL430855
TypeSmall organic molecule
Emp. Form.C25H22BrNO
Mol. Mass.432.352
SMILESCC1=CC(C)(C)Nc2ccc3-c4ccccc4OC(c4cccc(Br)c4)c3c12