Reaction Details
TargetGlucocorticoid receptor
LigandBDBM50062409
Substrate/Competitorn/a
Meas. Tech.ChEMBL_71406 (CHEMBL680192)
Ki 67±n/a nM
Citation Zhi, LTegley, CMKallel, EAMarschke, KBMais, DEGottardis, MMJones, TK 5-Aryl-1,2-dihydrochromeno[3,4-f]quinolines: a novel class of nonsteroidal human progesterone receptor agonists. J Med Chem41:291-302 (1998) 
 
Glucocorticoid receptor
Name:Glucocorticoid receptor
Type:Enzyme
Mol. Mass.:85656.87
Organism:Homo sapiens (Human)
Description:P04150
Residue:777
BDBM50062409
NameBDBM50062409
Synonyms:5-(4-Bromo-phenyl)-2,2,4-trimethyl-2,5-dihydro-1H-6-oxa-1-aza-chrysene | CHEMBL103232
TypeSmall organic molecule
Emp. Form.C25H22BrNO
Mol. Mass.432.352
SMILESCC1=CC(C)(C)Nc2ccc3-c4ccccc4OC(c4ccc(Br)cc4)c3c12