Reaction Details
TargetAndrogen receptor
LigandBDBM50062417
Substrate/Competitorn/a
Meas. Tech.ChEMBL_36108 (CHEMBL648073)
IC50 1550±n/a nM
Citation Zhi, LTegley, CMKallel, EAMarschke, KBMais, DEGottardis, MMJones, TK 5-Aryl-1,2-dihydrochromeno[3,4-f]quinolines: a novel class of nonsteroidal human progesterone receptor agonists. J Med Chem41:291-302 (1998) 
 
Androgen receptor
Name:Androgen receptor
Type:Receptor
Mol. Mass.:99185.27
Organism:Homo sapiens (Human)
Description:CHO cells were stably transfected with human AR gene.
Residue:920
BDBM50062417
NameBDBM50062417
Synonyms:5-(4-Chloro-phenyl)-2,2,4-trimethyl-2,5-dihydro-1H-6-oxa-1-aza-chrysene | CHEMBL286595
TypeSmall organic molecule
Emp. Form.C25H22ClNO
Mol. Mass.387.901
SMILESCC1=CC(C)(C)Nc2ccc3-c4ccccc4OC(c4ccc(Cl)cc4)c3c12