Reaction Details
TargetMuscarinic acetylcholine receptor M1
LigandBDBM50062577
Substrate/Competitorn/a
Meas. Tech.ChEMBL_138688 (CHEMBL749925)
IC50 0.55±n/a nM
Citation Ward, JSMerritt, LCalligaro, DOBymaster, FPShannon, HEMitch, CHWhitesitt, CBrunsting, DSheardown, MJOlesen, PHSwedberg, MDJeppesen, LSauerberg, P 1,2,5-Thiadiazole analogues of aceclidine as potent m1 muscarinic agonists. J Med Chem41:379-92 (1998) 
 
Muscarinic acetylcholine receptor M1
Name:Muscarinic acetylcholine receptor M1
Type:Enzyme Catalytic Domain
Mol. Mass.:51390.46
Organism:RAT
Description:P08482
Residue:460
BDBM50062577
NameBDBM50062577
Synonyms:6-(4-Propylsulfanyl-[1,2,5]thiadiazol-3-yloxy)-1-aza-bicyclo[3.2.1]octane | CHEMBL340435
TypeSmall organic molecule
Emp. Form.C12H19N3OS2
Mol. Mass.285.429
SMILESCCCSc1nsnc1OC1CN2CC1CCC2