Reaction Details
TargetNuclear factor NF-kappa-B p105 subunit
LigandBDBM50062653
Substrate/Competitorn/a
Meas. Tech.ChEMBL_143916 (CHEMBL752719)
IC50 620±n/a nM
Citation Sullivan, RWBigam, CGErdman, PEPalanki, MSAnderson, DWGoldman, MERansone, LJSuto, MJ 2-Chloro-4-(trifluoromethyl)pyrimidine-5-N-(3',5'- bis(trifluoromethyl)phenyl)-carboxamide: a potent inhibitor of NF-kappa B- and AP-1-mediated gene expression identified using solution-phase combinatorial chemistry. J Med Chem41:413-9 (1998) 
 
Nuclear factor NF-kappa-B p105 subunit
Name:Nuclear factor NF-kappa-B p105 subunit
Type:Protein
Mol. Mass.:105329.57
Organism:Homo sapiens (Human)
Description:P19838
Residue:968
BDBM50062653
NameBDBM50062653
Synonyms:3-[(2-Chloro-4-trifluoromethyl-pyrimidine-5-carbonyl)-amino]-5-trifluoromethyl-benzoic acid hexyl ester | CHEMBL423153
TypeSmall organic molecule
Emp. Form.C20H18ClF6N3O3
Mol. Mass.497.819
SMILESCCCCCCOC(=O)c1cc(NC(=O)c2cnc(Cl)nc2C(F)(F)F)cc(c1)C(F)(F)F