Reaction Details
TargetCyclic AMP-dependent transcription factor ATF-1
LigandBDBM50062673
Substrate/Competitorn/a
Meas. Tech.ChEMBL_27877 (CHEMBL640575)
IC50 2800±n/a nM
Citation Sullivan, RWBigam, CGErdman, PEPalanki, MSAnderson, DWGoldman, MERansone, LJSuto, MJ 2-Chloro-4-(trifluoromethyl)pyrimidine-5-N-(3',5'- bis(trifluoromethyl)phenyl)-carboxamide: a potent inhibitor of NF-kappa B- and AP-1-mediated gene expression identified using solution-phase combinatorial chemistry. J Med Chem41:413-9 (1998) 
 
Cyclic AMP-dependent transcription factor ATF-1
Name:Cyclic AMP-dependent transcription factor ATF-1
Type:PROTEIN
Mol. Mass.:29236.24
Organism:Homo sapiens (Human)
Description:ChEMBL_27877
Residue:271
BDBM50062673
NameBDBM50062673
Synonyms:2-Chloro-4-trifluoromethyl-pyrimidine-5-carboxylic acid (5-methyl-thiophen-2-yl)-amide | CHEMBL134990
TypeSmall organic molecule
Emp. Form.C11H7ClF3N3OS
Mol. Mass.321.706
SMILESCc1ccc(NC(=O)c2cnc(Cl)nc2C(F)(F)F)s1