Reaction Details
TargetSodium-dependent dopamine transporter
LigandBDBM50062679
Substrate/Competitorn/a
Meas. Tech.ChEMBL_62626 (CHEMBL678248)
Ki 13.87±n/a nM
Citation Meegalla, SKPlössl, KKung, MPStevenson, DAMu, MKushner, SLiable-Sands, LMRheingold, ALKung, HF Specificity of diastereomers of [99mTc]TRODAT-1 as dopamine transporter imaging agents. J Med Chem41:428-36 (1998) 
 
Sodium-dependent dopamine transporter
Name:Sodium-dependent dopamine transporter
Type:Multi-pass membrane protein
Mol. Mass.:68749.45
Organism:Rattus norvegicus (rat)
Description:P23977
Residue:619
BDBM50062679
NameBDBM50062679
Synonyms:2-[[2-[[[3-(4-chlorophenyl)-8-methyl-8-azabicyclo[3.2.1]oct-2-yl]methyl](2-mercaptoethyl)amino]ethyl]amino]ethanethiolato(3-)-oxo-[1R-(exo-exo)]-;2-{Oxo[N(R),N-bis(2-mercaptoethyl)ethylenediaminato]rhenium(V)methyl}-3-(4-chlorophenyl)tropane | CHEMBL344693
TypeSmall organic molecule
Emp. Form.C20H29ClN3OReS2
Mol. Mass.613.254
SMILESCN1C2CCC1[C@@H]([C@H]2CN1CCS[Re]2(=O)SCCN2CC1)c1ccc(Cl)cc1