Reaction Details
TargetIntegrin alpha-IIb/beta-3
LigandBDBM50062804
Substrate/Competitorn/a
Meas. Tech.ChEMBL_70180 (CHEMBL685829)
IC50 8.1±n/a nM
Citation Sugihara, HFukushi, HMiyawaki, TImai, YTerashita, ZKawamura, MFujisawa, YKita, S Novel non-peptide fibrinogen receptor antagonists. 1. Synthesis and glycoprotein IIb-IIIa antagonistic activities of 1,3,4-trisubstituted 2-oxopiperazine derivatives incorporating side-chain functions of the RGDF peptide. J Med Chem41:489-502 (1998) 
 
Integrin alpha-IIb/beta-3
Name:Integrin alpha-IIb/beta-3
Synonyms:Glycoprotein IIb/IIIa
Type:n/a
Mol. Mass.:n/a
Description:ASSAY_ID of EBI is 30109
Components:This complex has 2 components.
Component 1
Name:Integrin beta-3
Type:Protein
Mol. Mass.:87038.91
Organism:Homo sapiens (Human)
Description:P05106
Residue:788
Component 2
Name:Integrin alpha-IIb
Synonyms:CD_antigen=CD41 GPIIb Glycoprotein IIb ITGA2B Integrin alpha-IIb heavy chain Integrin alpha-IIb light chain, form 2 Integrin alpha-V/beta-3 and alpha-IIb/beta 3 | Platelet membrane glycoprotein IIb
Type:Protein
Mol. Mass.:113354.85
Organism:Homo sapiens (Human)
Description:P08514
Residue:1039
BDBM50062804
NameBDBM50062804
Synonyms:((S)-1-{2-[2-(4-Carbamimidoyl-phenyl)-acetylamino]-acetyl}-4-carboxymethyl-3-oxo-piperazin-2-yl)-acetic acid | CHEMBL146031
TypeSmall organic molecule
Emp. Form.C19H23N5O7
Mol. Mass.433.4152
SMILESNC(=N)c1ccc(CC(=O)NCC(=O)N2CCN(CC(O)=O)C(=O)[C@@H]2CC(O)=O)cc1