Reaction Details
TargetMethylated-DNA--protein-cysteine methyltransferase
LigandBDBM50062823
Substrate/Competitorn/a
Meas. Tech.ChEMBL_144844 (CHEMBL752890)
IC50 51±n/a nM
Citation Terashima, IKohda, K Inhibition of human O6-alkylguanine-DNA alkyltransferase and potentiation of the cytotoxicity of chloroethylnitrosourea by 4(6)-(benzyloxy)-2,6(4)-diamino-5-(nitro or nitroso)pyrimidine derivatives and analogues. J Med Chem41:503-8 (1998) 
 
Methylated-DNA--protein-cysteine methyltransferase
Name:Methylated-DNA--protein-cysteine methyltransferase
Type:PROTEIN
Mol. Mass.:21651.27
Organism:Homo sapiens (Human)
Description:ChEMBL_144711
Residue:207
BDBM50062823
NameBDBM50062823
Synonyms:6-(4-Fluoro-benzyloxy)-5-nitroso-pyrimidine-2,4-diamine | CHEMBL149722
TypeSmall organic molecule
Emp. Form.C11H10FN5O2
Mol. Mass.263.2278
SMILESNc1nc(N)c(N=O)c(OCc2ccc(F)cc2)n1