Reaction Details
TargetAdenosine receptor A1
LigandBDBM50062855
Substrate/Competitorn/a
Meas. Tech.ChEMBL_29122 (CHEMBL642256)
Ki 0.493±n/a nM
Citation Holschbach, MHFein, TKrummeich, CLewis, RGWutz, WSchwabe, UUnterlugauer, DOlsson, RA A1 adenosine receptor antagonists as ligands for positron emission tomography (PET) and single-photon emission tomography (SPET). J Med Chem41:555-63 (1998) 
 
Adenosine receptor A1
Name:Adenosine receptor A1
Type:Enzyme Catalytic Domain
Mol. Mass.:36602.99
Organism:BOVINE
Description:ADENOSINE 0 BOVINE::P28190
Residue:326
BDBM50062855
NameBDBM50062855
Synonyms:8-Cyclopentyl-3-ethoxymethyl-1-propyl-3,7-dihydro-purine-2,6-dione | CHEMBL357346
TypeSmall organic molecule
Emp. Form.C16H24N4O3
Mol. Mass.320.3868
SMILESCCCn1c(=O)n(COCC)c2nc([nH]c2c1=O)C1CCCC1