Reaction Details
TargetAdenosine receptor A1
LigandBDBM21173
Substrate/Competitorn/a
Meas. Tech.ChEMBL_29122 (CHEMBL642256)
Ki 0.155±n/a nM
Citation Holschbach, MHFein, TKrummeich, CLewis, RGWutz, WSchwabe, UUnterlugauer, DOlsson, RA A1 adenosine receptor antagonists as ligands for positron emission tomography (PET) and single-photon emission tomography (SPET). J Med Chem41:555-63 (1998) 
 
Adenosine receptor A1
Name:Adenosine receptor A1
Type:Enzyme Catalytic Domain
Mol. Mass.:36602.99
Organism:BOVINE
Description:ADENOSINE 0 BOVINE::P28190
Residue:326
BDBM21173
NameBDBM21173
Synonyms:1,3-dipropyl-8-cyclopentylxanthine CHEMBL183 PD116948 | [3H]DPCPX
Typeradiolabeled ligand
Emp. Form.C16H24N4O2
Mol. Mass.304.3874
SMILESCCCn1c2nc([nH]c2c(=O)n(CCC)c1=O)C1CCCC1