Reaction Details
TargetAdenosine receptor A1
LigandBDBM50011824
Substrate/Competitorn/a
Meas. Tech.ChEMBL_29122 (CHEMBL642256)
Ki 0.526±n/a nM
Citation Holschbach, MHFein, TKrummeich, CLewis, RGWutz, WSchwabe, UUnterlugauer, DOlsson, RA A1 adenosine receptor antagonists as ligands for positron emission tomography (PET) and single-photon emission tomography (SPET). J Med Chem41:555-63 (1998) 
 
Adenosine receptor A1
Name:Adenosine receptor A1
Type:Enzyme Catalytic Domain
Mol. Mass.:36602.99
Organism:BOVINE
Description:ADENOSINE 0 BOVINE::P28190
Residue:326
BDBM50011824
NameBDBM50011824
Synonyms:8-Cyclopentyl-1-methyl-3-propyl-3,7-dihydro-purine-2,6-dione | CHEMBL34004
TypeSmall organic molecule
Emp. Form.C14H20N4O2
Mol. Mass.276.3342
SMILESCCCn1c2nc([nH]c2c(=O)n(C)c1=O)C1CCCC1