Reaction Details
TargetD(2) dopamine receptor
LigandBDBM50063296
Substrate/Competitorn/a
Meas. Tech.ChEMBL_60370 (CHEMBL672206)
Ki 5.2±n/a nM
Citation Wustrow, DBelliotti, TGlase, SKesten, SRJohnson, DColbry, NRubin, RBlackburn, AAkunne, HCorbin, ADavis, MDGeorgic, LWhetzel, SZoski, KHeffner, TPugsley, TWise, L Aminopyrimidines with high affinity for both serotonin and dopamine receptors. J Med Chem41:760-71 (1998) 
 
D(2) dopamine receptor
Name:D(2) dopamine receptor
Type:Cell-surface receptors
Mol. Mass.:50647.10
Organism:Homo sapiens (Human)
Description:P14416
Residue:443
BDBM50063296
NameBDBM50063296
Synonyms:CHEMBL165679 | {4-[2-(4-Phenyl-piperazin-1-yl)-ethyl]-cyclohexyl}-pyrimidin-2-yl-amine
TypeSmall organic molecule
Emp. Form.C22H31N5
Mol. Mass.365.515
SMILESC(CN1CCN(CC1)c1ccccc1)[C@H]1CC[C@@H](CC1)Nc1ncccn1