Reaction Details
Target5-hydroxytryptamine receptor 1A
LigandBDBM50063288
Substrate/Competitorn/a
Meas. Tech.ChEMBL_1451 (CHEMBL616575)
Ki 4.7±n/a nM
Citation Wustrow, DBelliotti, TGlase, SKesten, SRJohnson, DColbry, NRubin, RBlackburn, AAkunne, HCorbin, ADavis, MDGeorgic, LWhetzel, SZoski, KHeffner, TPugsley, TWise, L Aminopyrimidines with high affinity for both serotonin and dopamine receptors. J Med Chem41:760-71 (1998) 
 
5-hydroxytryptamine receptor 1A
Name:5-hydroxytryptamine receptor 1A
Type:G Protein-Coupled Receptor (GPCR)
Mol. Mass.:46445.29
Organism:Rattus norvegicus (rat)
Description:Binding assays were performed using rat hippocampal membranes.
Residue:422
BDBM50063288
NameBDBM50063288
Synonyms:CHEMBL165047 | Methyl-{4-[2-(4-phenyl-piperazin-1-yl)-ethyl]-cyclohexyl}-pyrimidin-2-yl-amine
TypeSmall organic molecule
Emp. Form.C23H33N5
Mol. Mass.379.5416
SMILESCN([C@H]1CC[C@H](CCN2CCN(CC2)c2ccccc2)CC1)c1ncccn1