Reaction Details
TargetD(2) dopamine receptor
LigandBDBM50063288
Substrate/Competitorn/a
Meas. Tech.ChEMBL_60370 (CHEMBL672206)
Ki 4.8±n/a nM
Citation Wustrow, DBelliotti, TGlase, SKesten, SRJohnson, DColbry, NRubin, RBlackburn, AAkunne, HCorbin, ADavis, MDGeorgic, LWhetzel, SZoski, KHeffner, TPugsley, TWise, L Aminopyrimidines with high affinity for both serotonin and dopamine receptors. J Med Chem41:760-71 (1998) 
 
D(2) dopamine receptor
Name:D(2) dopamine receptor
Type:Cell-surface receptors
Mol. Mass.:50647.10
Organism:Homo sapiens (Human)
Description:P14416
Residue:443
BDBM50063288
NameBDBM50063288
Synonyms:CHEMBL165047 | Methyl-{4-[2-(4-phenyl-piperazin-1-yl)-ethyl]-cyclohexyl}-pyrimidin-2-yl-amine
TypeSmall organic molecule
Emp. Form.C23H33N5
Mol. Mass.379.5416
SMILESCN([C@H]1CC[C@H](CCN2CCN(CC2)c2ccccc2)CC1)c1ncccn1