Reaction Details
Target5-hydroxytryptamine receptor 1A
LigandBDBM50063285
Substrate/Competitorn/a
Meas. Tech.ChEMBL_1451 (CHEMBL616575)
Ki 13±n/a nM
Citation Wustrow, DBelliotti, TGlase, SKesten, SRJohnson, DColbry, NRubin, RBlackburn, AAkunne, HCorbin, ADavis, MDGeorgic, LWhetzel, SZoski, KHeffner, TPugsley, TWise, L Aminopyrimidines with high affinity for both serotonin and dopamine receptors. J Med Chem41:760-71 (1998) 
 
5-hydroxytryptamine receptor 1A
Name:5-hydroxytryptamine receptor 1A
Type:G Protein-Coupled Receptor (GPCR)
Mol. Mass.:46445.29
Organism:Rattus norvegicus (rat)
Description:Binding assays were performed using rat hippocampal membranes.
Residue:422
BDBM50063285
NameBDBM50063285
Synonyms:CHEMBL165056 | Pyrimidin-2-yl-(4-{2-[4-(3-trifluoromethyl-phenyl)-piperazin-1-yl]-ethyl}-cyclohexyl)-amine
TypeSmall organic molecule
Emp. Form.C23H30F3N5
Mol. Mass.433.513
SMILESFC(F)(F)c1cccc(c1)N1CCN(CC[C@H]2CC[C@@H](CC2)Nc2ncccn2)CC1