Reaction Details
Target5-hydroxytryptamine receptor 1A
LigandBDBM50063289
Substrate/Competitorn/a
Meas. Tech.ChEMBL_1451 (CHEMBL616575)
Ki 16±n/a nM
Citation Wustrow, DBelliotti, TGlase, SKesten, SRJohnson, DColbry, NRubin, RBlackburn, AAkunne, HCorbin, ADavis, MDGeorgic, LWhetzel, SZoski, KHeffner, TPugsley, TWise, L Aminopyrimidines with high affinity for both serotonin and dopamine receptors. J Med Chem41:760-71 (1998) 
 
5-hydroxytryptamine receptor 1A
Name:5-hydroxytryptamine receptor 1A
Type:G Protein-Coupled Receptor (GPCR)
Mol. Mass.:46445.29
Organism:Rattus norvegicus (rat)
Description:Binding assays were performed using rat hippocampal membranes.
Residue:422
BDBM50063289
NameBDBM50063289
Synonyms:CHEMBL165140 | {4-[3-(4-Phenyl-piperazin-1-yl)-propyl]-cyclohexyl}-pyrimidin-2-yl-amine
TypeSmall organic molecule
Emp. Form.C23H33N5
Mol. Mass.379.5416
SMILESC(C[C@H]1CC[C@@H](CC1)Nc1ncccn1)CN1CCN(CC1)c1ccccc1