Reaction Details
TargetGlycylpeptide N-tetradecanoyltransferase
LigandBDBM50034993
Substrate/Competitorn/a
Meas. Tech.ChEMBL_141299 (CHEMBL748914)
Ki 31±n/a nM
Citation Devadas, BFreeman, SKMcWherter, CAKishore, NSLodge, JKJackson-Machelski, EGordon, JISikorski, JA Novel biologically active nonpeptidic inhibitors of myristoylCoA:protein N-myristoyltransferase. J Med Chem41:996-1000 (1998) 
 
Glycylpeptide N-tetradecanoyltransferase
Name:Glycylpeptide N-tetradecanoyltransferase
Type:Enzyme
Mol. Mass.:51875.96
Organism:Candida albicans (Yeast)
Description:P30418
Residue:451
BDBM50034993
NameBDBM50034993
Synonyms:(S)-6-Amino-2-[(S)-3-hydroxy-2-(2-{4-[4-(2-methyl-imidazol-1-yl)-butyl]-phenyl}-acetylamino)-propionylamino]-hexanoic acid (2-cyclohexyl-ethyl)-amide SC-58272 | [CYCLOHEXYLETHYL]-[[[[4-[2-METHYL-1-IMIDAZOLYL-BUTYL]PHENYL]ACETYL]-SERYL]-LYSINYL]-AMINE
TypeSmall organic molecule
Emp. Form.C33H52N6O4
Mol. Mass.596.8038
SMILESCc1nccn1CCCCc1ccc(CC(=O)N[C@@H](CO)C(=O)N[C@@H](CCCCN)C(=O)NCCC2CCCCC2)cc1