Reaction Details
TargetProthrombin
LigandBDBM50063555
Substrate/Competitorn/a
Meas. Tech.ChEMBL_208871 (CHEMBL808337)
IC50 0.100000±n/a nM
Citation Lumma, WCWitherup, KMTucker, TJBrady, SFSisko, JTNaylor-Olsen, AMLewis, SDLucas, BJVacca, JP Design of novel, potent, noncovalent inhibitors of thrombin with nonbasic P-1 substructures: rapid structure-activity studies by solid-phase synthesis. J Med Chem41:1011-3 (1998) 
 
Prothrombin
Name:Prothrombin
Type:Protein
Mol. Mass.:70029.57
Organism:Homo sapiens (Human)
Description:P00734
Residue:622
BDBM50063555
NameBDBM50063555
Synonyms:1-(2-Amino-3,3-diphenyl-propionyl)-pyrrolidine-2-carboxylic acid (4-amino-cyclohexylmethyl)-amide | CHEMBL269744
TypeSmall organic molecule
Emp. Form.C27H36N4O2
Mol. Mass.448.6003
SMILESNC(C(c1ccccc1)c1ccccc1)C(=O)N1CCCC1C(=O)NC[C@H]1CC[C@H](N)CC1