Reaction Details
TargetComplement C1r subcomponent
LigandBDBM50063697
Substrate/Competitorn/a
Meas. Tech.ChEMBL_40165 (CHEMBL655960)
IC50 2000±n/a nM
Citation Hays, SJCaprathe, BWGilmore, JLAmin, NEmmerling, MRMichael, WNadimpalli, RNath, RRaser, KJStafford, DWatson, DWang, KJaen, JC 2-amino-4H-3,1-benzoxazin-4-ones as inhibitors of C1r serine protease. J Med Chem41:1060-7 (1998) 
 
Complement C1r subcomponent
Name:Complement C1r subcomponent
Type:Enzyme
Mol. Mass.:80113.65
Organism:Homo sapiens (Human)
Description:P00736
Residue:705
BDBM50063697
NameBDBM50063697
Synonyms:2-(2,5-Dichloro-phenylamino)-benzo[d][1,3]oxazin-4-one | CHEMBL274816
TypeSmall organic molecule
Emp. Form.C14H8Cl2N2O2
Mol. Mass.307.132
SMILESClc1ccc(Cl)c(Nc2nc3ccccc3c(=O)o2)c1