Reaction Details
TargetComplement C1r subcomponent
LigandBDBM50063745
Substrate/Competitorn/a
Meas. Tech.ChEMBL_40165 (CHEMBL655960)
IC50 4000±n/a nM
Citation Hays, SJCaprathe, BWGilmore, JLAmin, NEmmerling, MRMichael, WNadimpalli, RNath, RRaser, KJStafford, DWatson, DWang, KJaen, JC 2-amino-4H-3,1-benzoxazin-4-ones as inhibitors of C1r serine protease. J Med Chem41:1060-7 (1998) 
 
Complement C1r subcomponent
Name:Complement C1r subcomponent
Type:Enzyme
Mol. Mass.:80113.65
Organism:Homo sapiens (Human)
Description:P00736
Residue:705
BDBM50063745
NameBDBM50063745
Synonyms:2-(2-Iodo-phenylamino)-7-trifluoromethyl-benzo[d][1,3]oxazin-4-one | CHEMBL10312
TypeSmall organic molecule
Emp. Form.C15H8F3IN2O2
Mol. Mass.432.1359
SMILESFC(F)(F)c1ccc2c(c1)nc(Nc1ccccc1I)oc2=O