Reaction Details
TargetComplement C1r subcomponent
LigandBDBM50063711
Substrate/Competitorn/a
Meas. Tech.ChEMBL_40165 (CHEMBL655960)
IC50 900±n/a nM
Citation Hays, SJCaprathe, BWGilmore, JLAmin, NEmmerling, MRMichael, WNadimpalli, RNath, RRaser, KJStafford, DWatson, DWang, KJaen, JC 2-amino-4H-3,1-benzoxazin-4-ones as inhibitors of C1r serine protease. J Med Chem41:1060-7 (1998) 
 
Complement C1r subcomponent
Name:Complement C1r subcomponent
Type:Enzyme
Mol. Mass.:80113.65
Organism:Homo sapiens (Human)
Description:P00736
Residue:705
BDBM50063711
NameBDBM50063711
Synonyms:7-Chloro-2-(2-iodo-phenylamino)-benzo[d][1,3]oxazin-4-one | CHEMBL10432
TypeSmall organic molecule
Emp. Form.C14H8ClIN2O2
Mol. Mass.398.583
SMILESClc1ccc2c(c1)nc(Nc1ccccc1I)oc2=O