Reaction Details
TargetComplement C1r subcomponent
LigandBDBM50063724
Substrate/Competitorn/a
Meas. Tech.ChEMBL_40166 (CHEMBL655961)
IC50 900±n/a nM
Citation Hays, SJCaprathe, BWGilmore, JLAmin, NEmmerling, MRMichael, WNadimpalli, RNath, RRaser, KJStafford, DWatson, DWang, KJaen, JC 2-amino-4H-3,1-benzoxazin-4-ones as inhibitors of C1r serine protease. J Med Chem41:1060-7 (1998) 
 
Complement C1r subcomponent
Name:Complement C1r subcomponent
Type:Enzyme
Mol. Mass.:80113.65
Organism:Homo sapiens (Human)
Description:P00736
Residue:705
BDBM50063724
NameBDBM50063724
Synonyms:2-(2,6-Dichloro-phenylamino)-benzo[d][1,3]oxazin-4-one | CHEMBL10252
TypeSmall organic molecule
Emp. Form.C14H8Cl2N2O2
Mol. Mass.307.132
SMILESClc1cccc(Cl)c1Nc1nc2ccccc2c(=O)o1