Reaction Details
TargetComplement C1r subcomponent
LigandBDBM50063732
Substrate/Competitorn/a
Meas. Tech.ChEMBL_40165 (CHEMBL655960)
IC50 900±n/a nM
Citation Hays, SJCaprathe, BWGilmore, JLAmin, NEmmerling, MRMichael, WNadimpalli, RNath, RRaser, KJStafford, DWatson, DWang, KJaen, JC 2-amino-4H-3,1-benzoxazin-4-ones as inhibitors of C1r serine protease. J Med Chem41:1060-7 (1998) 
 
Complement C1r subcomponent
Name:Complement C1r subcomponent
Type:Enzyme
Mol. Mass.:80113.65
Organism:Homo sapiens (Human)
Description:P00736
Residue:705
BDBM50063732
NameBDBM50063732
Synonyms:2-(2-Chloro-phenylamino)-7-methyl-benzo[d][1,3]oxazin-4-one | CHEMBL10132
TypeSmall organic molecule
Emp. Form.C15H11ClN2O2
Mol. Mass.286.713
SMILESCc1ccc2c(c1)nc(Nc1ccccc1Cl)oc2=O