Reaction Details
TargetProstaglandin G/H synthase 2
LigandBDBM50063780
Substrate/Competitorn/a
Meas. Tech.ChEMBL_159934 (CHEMBL766988)
IC50 15±n/a nM
Citation Janusz, JMYoung, PARidgeway, JMScherz, MWEnzweiler, KWu, LIGan, LDarolia, RMatthews, RSHennes, DKellstein, DEGreen, SATulich, JLRosario-Jansen, TMagrisso, IJWehmeyer, KRKuhlenbeck, DLEichhold, THDobson, RLSirko, SPFarmer, RW New cyclooxygenase-2/5-lipoxygenase inhibitors. 1. 7-tert-buty1-2,3-dihydro-3,3-dimethylbenzofuran derivatives as gastrointestinal safe antiinflammatory and analgesic agents: discovery and variation of the 5-keto substituent. J Med Chem41:1112-23 (1998) 
 
Prostaglandin G/H synthase 2
Name:Prostaglandin G/H synthase 2
Type:Enzyme
Mol. Mass.:69003.89
Organism:Homo sapiens (Human)
Description:Recombinant Cox-2 provided by Cayman (Cayman Chemical Co.,Ann Arbor, MI).
Residue:604
BDBM50063780
NameBDBM50063780
Synonyms:1-(7-tert-Butyl-3,3-dimethyl-2,3-dihydro-benzofuran-5-yl)-hex-5-yn-1-one | CHEMBL13920
TypeSmall organic molecule
Emp. Form.C20H26O2
Mol. Mass.298.4192
SMILESCC(C)(C)c1cc(cc2c1OCC2(C)C)C(=O)CCCC#C