Reaction Details
TargetSigma non-opioid intracellular receptor 1
LigandBDBM50063807
Substrate/Competitorn/a
Meas. Tech.ChEMBL_200983 (CHEMBL801236)
Ki 47±n/a nM
Citation Ucar, HVan derpoorten, KCacciaguerra, SSpampinato, SStables, JPDepovere, PIsa, MMasereel, BDelarge, JPoupaert, JH Synthesis and anticonvulsant activity of 2(3H)-benzoxazolone and 2(3H)-benzothiazolone derivatives. J Med Chem41:1138-45 (1998) 
 
Sigma non-opioid intracellular receptor 1
Name:Sigma non-opioid intracellular receptor 1
Type:Enzyme Catalytic Domain
Mol. Mass.:25124.85
Organism:Homo sapiens (Human)
Description:Q99720
Residue:223
BDBM50063807
NameBDBM50063807
Synonyms:3-(2-Piperidin-1-yl-ethyl)-6-propionyl-3H-benzothiazol-2-one | CHEMBL14876
TypeSmall organic molecule
Emp. Form.C17H22N2O2S
Mol. Mass.318.434
SMILESCCC(=O)c1ccc2n(CCN3CCCCC3)c(=O)sc2c1