Reaction Details
TargetAlpha-1B adrenergic receptor
LigandBDBM50063907
Substrate/Competitorn/a
Meas. Tech.ChEMBL_34348 (CHEMBL649161)
Ki 2±n/a nM
Citation Patane, MAScott, ALBroten, TPChang, RSRansom, RWDiSalvo, JForray, CBock, MG 4-Amino-2-[4-[1-(benzyloxycarbonyl)-2(S)- [[(1,1-dimethylethyl)amino]carbonyl]-piperazinyl]-6, 7-dimethoxyquinazoline (L-765,314): a potent and selective alpha1b adrenergic receptor antagonist. J Med Chem41:1205-8 (1998) 
 
Alpha-1B adrenergic receptor
Name:Alpha-1B adrenergic receptor
Type:Enzyme
Mol. Mass.:56862.13
Organism:Homo sapiens (Human)
Description:P35368
Residue:520
BDBM50063907
NameBDBM50063907
Synonyms:(S)-4-(4-Amino-6,7-dimethoxy-quinazolin-2-yl)-2-tert-butylcarbamoyl-piperazine-1-carboxylic acid benzyl ester L-765314
TypeSmall organic molecule
Emp. Form.C27H34N6O5
Mol. Mass.522.5961
SMILESCOc1cc2nc(nc(N)c2cc1OC)N1CCN([C@@H](C1)C(=O)NC(C)(C)C)C(=O)OCc1ccccc1