Reaction Details
TargetMatrix metalloproteinase-9
LigandBDBM50063910
Substrate/Competitorn/a
Meas. Tech.ChEMBL_105225 (CHEMBL710584)
IC50 1.3±n/a nM
Citation Yamamoto, MTsujishita, HHori, NOhishi, YInoue, SIkeda, SOkada, Y Inhibition of membrane-type 1 matrix metalloproteinase by hydroxamate inhibitors: an examination of the subsite pocket. J Med Chem41:1209-17 (1998) 
 
Matrix metalloproteinase-9
Name:Matrix metalloproteinase-9
Type:Enzyme
Mol. Mass.:78452.28
Organism:Homo sapiens (Human)
Description:P14780
Residue:707
BDBM50063910
NameBDBM50063910
Synonyms:(R)-N*1*-((S)-2,2-Dimethyl-1-methylcarbamoyl-propyl)-N*4*-hydroxy-2-(3-phenyl-propyl)-succinamide CHEMBL20154
TypeSmall organic molecule
Emp. Form.C20H31N3O4
Mol. Mass.377.4778
SMILESCNC(=O)[C@@H](NC(=O)[C@H](CCCc1ccccc1)CC(=O)NO)C(C)(C)C