Reaction Details
TargetMatrix metalloproteinase-14
LigandBDBM50063913
Substrate/Competitorn/a
Meas. Tech.ChEMBL_217867 (CHEMBL822190)
IC50 2.3±n/a nM
Citation Yamamoto, MTsujishita, HHori, NOhishi, YInoue, SIkeda, SOkada, Y Inhibition of membrane-type 1 matrix metalloproteinase by hydroxamate inhibitors: an examination of the subsite pocket. J Med Chem41:1209-17 (1998) 
 
Matrix metalloproteinase-14
Name:Matrix metalloproteinase-14
Type:Protein
Mol. Mass.:65900.19
Organism:Homo sapiens (Human)
Description:P50281
Residue:582
BDBM50063913
NameBDBM50063913
Synonyms:(R)-N*1*-((S)-Cyclohexyl-methylcarbamoyl-methyl)-N*4*-hydroxy-2-isobutyl-succinamide | CHEMBL281371
TypeSmall organic molecule
Emp. Form.C17H31N3O4
Mol. Mass.341.4457
SMILESCNC(=O)[C@@H](NC(=O)[C@H](CC(C)C)CC(=O)NO)C1CCCCC1