Reaction Details
Target72 kDa type IV collagenase
LigandBDBM50062351
Substrate/Competitorn/a
Meas. Tech.ChEMBL_106804 (CHEMBL717492)
IC50 1.1±n/a nM
Citation Yamamoto, MTsujishita, HHori, NOhishi, YInoue, SIkeda, SOkada, Y Inhibition of membrane-type 1 matrix metalloproteinase by hydroxamate inhibitors: an examination of the subsite pocket. J Med Chem41:1209-17 (1998) 
 
72 kDa type IV collagenase
Name:72 kDa type IV collagenase
Type:Enzyme
Mol. Mass.:73870.36
Organism:Homo sapiens (Human)
Description: P08253
Residue:660
BDBM50062351
NameBDBM50062351
Synonyms:(R)-N*4*-Hydroxy-N*1*-[(S)-2-(1H-indol-3-yl)-1-methylcarbamoyl-ethyl]-2-isobutyl-succinamide (R)-N1-((S)-3-(1H-indol-3-yl)-1-(methylamino)-1-oxopropan-2-yl)-N4-hydroxy-2-isobutylsuccinamide CHEMBL19611 US9487462, ilomastat
TypeSmall organic molecule
Emp. Form.C20H28N4O4
Mol. Mass.388.4607
SMILESCNC(=O)[C@H](Cc1c[nH]c2ccccc12)NC(=O)[C@H](CC(C)C)CC(=O)NO