Reaction Details
TargetReverse transcriptase/RNaseH
LigandBDBM50063968
Substrate/Competitorn/a
Meas. Tech.ChEMBL_197123 (CHEMBL801613)
IC50>100000±n/a nM
Citation Porcari, ARDevivar, RVKucera, LSDrach, JCTownsend, LB Design, synthesis, and antiviral evaluations of 1-(substituted benzyl)-2-substituted-5,6-dichlorobenzimidazoles as nonnucleoside analogues of 2,5,6-trichloro-1-(beta-D-ribofuranosyl)benzimidazole. J Med Chem41:1252-62 (1998) 
 
Reverse transcriptase/RNaseH
Name:Reverse transcriptase/RNaseH
Type:PROTEIN
Mol. Mass.:65229.15
Organism:Human immunodeficiency virus 1
Description:ChEMBL_1473730
Residue:566
BDBM50063968
NameBDBM50063968
Synonyms:1-(3,5-Bis-trifluoromethyl-benzyl)-2-bromo-5,6-dichloro-1H-benzoimidazole | CHEMBL280386
TypeSmall organic molecule
Emp. Form.C16H7BrCl2F6N2
Mol. Mass.492.041
SMILESFC(F)(F)c1cc(Cn2c(Br)nc3cc(Cl)c(Cl)cc23)cc(c1)C(F)(F)F