Reaction Details
TargetReverse transcriptase/RNaseH
LigandBDBM50063948
Substrate/Competitorn/a
Meas. Tech.ChEMBL_197121 (CHEMBL801611)
IC50>32000±n/a nM
Citation Porcari, ARDevivar, RVKucera, LSDrach, JCTownsend, LB Design, synthesis, and antiviral evaluations of 1-(substituted benzyl)-2-substituted-5,6-dichlorobenzimidazoles as nonnucleoside analogues of 2,5,6-trichloro-1-(beta-D-ribofuranosyl)benzimidazole. J Med Chem41:1252-62 (1998) 
 
Reverse transcriptase/RNaseH
Name:Reverse transcriptase/RNaseH
Type:PROTEIN
Mol. Mass.:65229.15
Organism:Human immunodeficiency virus 1
Description:ChEMBL_1473730
Residue:566
BDBM50063948
NameBDBM50063948
Synonyms:2-Bromo-5,6-dichloro-1-(3-nitro-benzyl)-1H-benzoimidazole | CHEMBL25100
TypeSmall organic molecule
Emp. Form.C14H8BrCl2N3O2
Mol. Mass.401.042
SMILES[O-][N+](=O)c1cccc(Cn2c(Br)nc3cc(Cl)c(Cl)cc23)c1