Reaction Details
TargetReverse transcriptase/RNaseH
LigandBDBM50064007
Substrate/Competitorn/a
Meas. Tech.ChEMBL_196509 (CHEMBL798323)
IC50 179±n/a nM
Citation Wishka, DGGraber, DRKopta, LAOlmsted, RAFriis, JMHosley, JDAdams, WJSeest, EPCastle, TMDolak, LAKeiser, BJYagi, YJeganathan, ASchlachter, STMurphy, MJCleek, GJNugent, RAPoppe, SMSwaney, SMHan, FWatt, WWhite, WLPoel, TJThomas, RCMorris, J (-)-6-Chloro-2-[(1-furo[2, 3-c]pyridin-5-ylethyl)thio]-4-pyrimidinamine, PNU-142721, a new broad spectrum HIV-1 non-nucleoside reverse transcriptase inhibitor. J Med Chem41:1357-60 (1998) 
 
Reverse transcriptase/RNaseH
Name:Reverse transcriptase/RNaseH
Type:PROTEIN
Mol. Mass.:65229.15
Organism:Human immunodeficiency virus 1
Description:ChEMBL_1473730
Residue:566
BDBM50064007
NameBDBM50064007
Synonyms:6-CHLORO-2-(1-FURO[2,3-C]PYRIDIN-5-YL-ETHYLSULFANYL)-PYRIMIDIN-4-YLAMINE CHEMBL280541 | PNU-142721
TypeSmall organic molecule
Emp. Form.C13H11ClN4OS
Mol. Mass.306.771
SMILESC[C@H](Sc1nc(N)cc(Cl)n1)c1cc2ccoc2cn1