Reaction Details
TargetSomatostatin receptor type 2
LigandBDBM50064026
Substrate/Competitorn/a
Meas. Tech.ChEMBL_200364 (CHEMBL806299)
Ki 2700±n/a nM
Citation Hirschmann, RHynes, JCichy-Knight, MAvan Rijn, RDSprengeler, PASpoors, PGShakespeare, WCPietranico-Cole, SBarbosa, JLiu, JYao, WRohrer, SSmith, AB Modulation of receptor and receptor subtype affinities using diastereomeric and enantiomeric monosaccharide scaffolds as a means to structural and biological diversity. A new route to ether synthesis. J Med Chem41:1382-91 (1998) 
 
Somatostatin receptor type 2
Name:Somatostatin receptor type 2
Type:Enzyme
Mol. Mass.:41344.94
Organism:Homo sapiens (Human)
Description:P30874
Residue:369
BDBM50064026
NameBDBM50064026
Synonyms:5-{(2S,3S,4R,5S,6S)-3,4,5-Tris-benzyloxy-6-[2-(1H-indol-3-yl)-ethoxy]-tetrahydro-pyran-2-ylmethoxy}-pentylamine | CHEMBL282803
TypeSmall organic molecule
Emp. Form.C42H50N2O6
Mol. Mass.678.8562
SMILESNCCCCCOC[C@@H]1O[C@H](OCCc2c[nH]c3ccccc23)[C@@H](OCc2ccccc2)[C@H](OCc2ccccc2)[C@H]1OCc1ccccc1