Reaction Details
TargetSubstance-P receptor
LigandBDBM50064032
Substrate/Competitorn/a
Meas. Tech.ChEMBL_205579 (CHEMBL873268)
IC50 27±n/a nM
Citation Hirschmann, RHynes, JCichy-Knight, MAvan Rijn, RDSprengeler, PASpoors, PGShakespeare, WCPietranico-Cole, SBarbosa, JLiu, JYao, WRohrer, SSmith, AB Modulation of receptor and receptor subtype affinities using diastereomeric and enantiomeric monosaccharide scaffolds as a means to structural and biological diversity. A new route to ether synthesis. J Med Chem41:1382-91 (1998) 
 
Substance-P receptor
Name:Substance-P receptor
Type:G Protein-Coupled Receptor (GPCR)
Mol. Mass.:46254.43
Organism:Homo sapiens (Human)
Description:P25103
Residue:407
BDBM50064032
NameBDBM50064032
Synonyms:CHEMBL29161 N-(5-{4,5-Bis-benzyloxy-3-hydroxy-6-[2-(1H-indol-3-yl)-ethoxy]-tetrahydro-pyran-2-ylmethoxy}-pentyl)-acetamide
TypeSmall organic molecule
Emp. Form.C37H46N2O7
Mol. Mass.630.7703
SMILESCC(=O)NCCCCCOC[C@H]1O[C@@H](OCCc2c[nH]c3ccccc23)[C@H](OCc2ccccc2)[C@@H](OCc2ccccc2)[C@@H]1O