Reaction Details
TargetSomatostatin receptor type 4
LigandBDBM50064029
Substrate/Competitorn/a
Meas. Tech.ChEMBL_200515 (CHEMBL801019)
Ki 3000±n/a nM
Citation Hirschmann, RHynes, JCichy-Knight, MAvan Rijn, RDSprengeler, PASpoors, PGShakespeare, WCPietranico-Cole, SBarbosa, JLiu, JYao, WRohrer, SSmith, AB Modulation of receptor and receptor subtype affinities using diastereomeric and enantiomeric monosaccharide scaffolds as a means to structural and biological diversity. A new route to ether synthesis. J Med Chem41:1382-91 (1998) 
 
Somatostatin receptor type 4
Name:Somatostatin receptor type 4
Type:Enzyme
Mol. Mass.:42015.38
Organism:Homo sapiens (Human)
Description:P31391
Residue:388
BDBM50064029
NameBDBM50064029
Synonyms:5-{(2R,3S,5R,6R)-3-Benzyloxy-5-(1H-imidazol-4-ylmethoxy)-6-[2-(1H-indol-3-yl)-ethoxy]-tetrahydro-pyran-2-ylmethoxy}-pentylamine | CHEMBL28824
TypeSmall organic molecule
Emp. Form.C32H42N4O5
Mol. Mass.562.6997
SMILESNCCCCCOC[C@H]1O[C@@H](OCCc2c[nH]c3ccccc23)[C@@H](C[C@@H]1OCc1ccccc1)OCc1cnc[nH]1