Reaction Details
TargetSomatostatin receptor type 4
LigandBDBM50051578
Substrate/Competitorn/a
Meas. Tech.ChEMBL_200515 (CHEMBL801019)
Ki 1700±n/a nM
Citation Hirschmann, RHynes, JCichy-Knight, MAvan Rijn, RDSprengeler, PASpoors, PGShakespeare, WCPietranico-Cole, SBarbosa, JLiu, JYao, WRohrer, SSmith, AB Modulation of receptor and receptor subtype affinities using diastereomeric and enantiomeric monosaccharide scaffolds as a means to structural and biological diversity. A new route to ether synthesis. J Med Chem41:1382-91 (1998) 
 
Somatostatin receptor type 4
Name:Somatostatin receptor type 4
Type:Enzyme
Mol. Mass.:42015.38
Organism:Homo sapiens (Human)
Description:P31391
Residue:388
BDBM50051578
NameBDBM50051578
Synonyms:5-{(2R,3S,5R,6R)-3,5-Bis-benzyloxy-6-[2-(1H-indol-3-yl)-ethoxy]-tetrahydro-pyran-2-ylmethoxy}-pentylamine | CHEMBL281200
TypeSmall organic molecule
Emp. Form.C35H44N2O5
Mol. Mass.572.7343
SMILESNCCCCCOC[C@H]1O[C@@H](OCCc2c[nH]c3ccccc23)[C@@H](C[C@@H]1OCc1ccccc1)OCc1ccccc1