Reaction Details
TargetCysteinyl leukotriene receptor 1
LigandBDBM50023198
Substrate/Competitorn/a
Meas. Tech.ChEMBL_52043 (CHEMBL666430)
IC50 1±n/a nM
Citation Zwaagstra, MESchoenmakers, SHNederkoorn, PHGelens, ETimmerman, HZhang, MQ Development of a three-dimensional CysLT1 (LTD4) antagonist model with an incorporated amino acid residue from the receptor. J Med Chem41:1439-45 (1998) 
 
Cysteinyl leukotriene receptor 1
Name:Cysteinyl leukotriene receptor 1
Type:Enzyme Catalytic Domain
Mol. Mass.:39007.58
Organism:GUINEA PIG
Description:Leukotriene D4 0 GUINEA PIG::Q2NNR5
Residue:340
BDBM50023198
NameBDBM50023198
Synonyms:8-[4-(4-phenylbutyloxy)benzoyl]amino-2-(tetrazol-5-yl)-4-oxo-4H-1-benzopyran N-(4-oxo-2-(1H-tetrazol-5-yl)-4H-chromen-8-yl)-4-(4-phenylbutoxy)benzamide N-[4-Oxo-2-(1H-tetrazol-5-yl)-4H-chromen-8-yl]-4-(4-phenyl-butoxy)-benzamide (ONO-RS-411) ONO-1078 | PRANLUKAST
TypeSmall organic molecule
Emp. Form.C27H23N5O4
Mol. Mass.481.5026
SMILESO=C(Nc1cccc2c1oc(cc2=O)-c1nnn[nH]1)c1ccc(OCCCCc2ccccc2)cc1