Reaction Details
TargetCysteinyl leukotriene receptor 1
LigandBDBM50052024
Substrate/Competitorn/a
Meas. Tech.ChEMBL_52215 (CHEMBL666684)
Ki 0.500000±n/a nM
Citation Zwaagstra, MESchoenmakers, SHNederkoorn, PHGelens, ETimmerman, HZhang, MQ Development of a three-dimensional CysLT1 (LTD4) antagonist model with an incorporated amino acid residue from the receptor. J Med Chem41:1439-45 (1998) 
 
Cysteinyl leukotriene receptor 1
Name:Cysteinyl leukotriene receptor 1
Type:Enzyme Catalytic Domain
Mol. Mass.:39007.58
Organism:GUINEA PIG
Description:Leukotriene D4 0 GUINEA PIG::Q2NNR5
Residue:340
BDBM50052024
NameBDBM50052024
Synonyms:CHEMBL787 | montelukast
TypeSmall organic molecule
Emp. Form.C35H36ClNO3S
Mol. Mass.586.183
SMILESCC(C)(O)c1ccccc1CC[C@@H](SCC1(CC(O)=O)CC1)c1cccc(\C=C\c2ccc3ccc(Cl)cc3n2)c1