Reaction Details
TargetProtein kinase C delta type
LigandBDBM50064088
Substrate/Competitorn/a
Meas. Tech.ChEMBL_160791 (CHEMBL766602)
Ki 1700±n/a nM
Citation Endo, YTakehana, SOhno, MDriedger, PEStabel, SMizutani, MYTomioka, NItai, AShudo, K Clarification of the binding mode of teleocidin and benzolactams to the Cys2 domain of protein kinase Cdelta by synthesis of hydrophobically modified, teleocidin-mimicking benzolactams and computational docking simulation. J Med Chem41:1476-96 (1998) 
 
Protein kinase C delta type
Name:Protein kinase C delta type
Type:Enzyme
Mol. Mass.:77516.79
Organism:Homo sapiens (Human)
Description:The recombinant human PKC enzymes were produced using a baculovirus expression system in SF9 cells
Residue:676
BDBM50064088
NameBDBM50064088
Synonyms:(7S,10S)-10-Hydroxymethyl-7-isopropyl-1,1,6-trimethyl-2,3,4,6,7,9,10,11-octahydro-1H-6,9-diaza-cycloocta[b]naphthalen-8-one | CHEMBL36821
TypeSmall organic molecule
Emp. Form.C21H32N2O2
Mol. Mass.344.491
SMILESCC(C)[C@@H]1N(C)c2cc3CCCC(C)(C)c3cc2C[C@@H](CO)NC1=O