Reaction Details
TargetProtein kinase C delta type
LigandBDBM50064091
Substrate/Competitorn/a
Meas. Tech.ChEMBL_160791 (CHEMBL766602)
Ki 5.9±n/a nM
Citation Endo, YTakehana, SOhno, MDriedger, PEStabel, SMizutani, MYTomioka, NItai, AShudo, K Clarification of the binding mode of teleocidin and benzolactams to the Cys2 domain of protein kinase Cdelta by synthesis of hydrophobically modified, teleocidin-mimicking benzolactams and computational docking simulation. J Med Chem41:1476-96 (1998) 
 
Protein kinase C delta type
Name:Protein kinase C delta type
Type:Enzyme
Mol. Mass.:77516.79
Organism:Homo sapiens (Human)
Description:The recombinant human PKC enzymes were produced using a baculovirus expression system in SF9 cells
Residue:676
BDBM50064091
NameBDBM50064091
Synonyms:(2S,5S)-9-Decyl-5-hydroxymethyl-2-isopropyl-1-methyl-1,4,5,6-tetrahydro-2H-benzo[e][1,4]diazocin-3-one | CHEMBL34971
TypeSmall organic molecule
Emp. Form.C25H42N2O2
Mol. Mass.402.6132
SMILESCCCCCCCCCCc1ccc2C[C@@H](CO)NC(=O)[C@H](C(C)C)N(C)c2c1