Reaction Details
TargetProtein kinase C delta type
LigandBDBM50064094
Substrate/Competitorn/a
Meas. Tech.ChEMBL_160791 (CHEMBL766602)
Ki 19±n/a nM
Citation Endo, YTakehana, SOhno, MDriedger, PEStabel, SMizutani, MYTomioka, NItai, AShudo, K Clarification of the binding mode of teleocidin and benzolactams to the Cys2 domain of protein kinase Cdelta by synthesis of hydrophobically modified, teleocidin-mimicking benzolactams and computational docking simulation. J Med Chem41:1476-96 (1998) 
 
Protein kinase C delta type
Name:Protein kinase C delta type
Type:Enzyme
Mol. Mass.:77516.79
Organism:Homo sapiens (Human)
Description:The recombinant human PKC enzymes were produced using a baculovirus expression system in SF9 cells
Residue:676
BDBM50064094
NameBDBM50064094
Synonyms:5'-hydroxymethyl-2'-isopropyl-1'-methyl-(2'S,5'S)-spiro[cyclohexane-1,11'-(1',2',3',4',5',6',8',9',10',11'-decahydronaphtho[2,3-e][1,4]diazocine)]-3'-one | CHEMBL34725
TypeSmall organic molecule
Emp. Form.C24H36N2O2
Mol. Mass.384.5548
SMILESCC(C)[C@@H]1N(C)c2cc3c(CCCC33CCCCC3)cc2C[C@@H](CO)NC1=O