Reaction Details
TargetMuscarinic acetylcholine receptor M2
LigandBDBM50064172
Substrate/Competitorn/a
Meas. Tech.ChEMBL_140190 (CHEMBL744907)
Ki 10800±n/a nM
Citation Quaglia, WGiannella, MPiergentili, APigini, MBrasili, LDi Toro, RRossetti, LSpampinato, SMelchiorre, C 1'-Benzyl-3,4-dihydrospiro[2H-1- benzothiopyran-2,4'-piperidine] (spipethiane), a potent and highly selective sigma1 ligand. J Med Chem41:1557-60 (1998) 
 
Muscarinic acetylcholine receptor M2
Name:Muscarinic acetylcholine receptor M2
Type:Enzyme Catalytic Domain
Mol. Mass.:51555.53
Organism:RAT
Description:P10980
Residue:466
BDBM50064172
NameBDBM50064172
Synonyms:1-benzylspiro[hexahydropyridine-4,2'-(3',4'-dihydro-2'H-thiochromene)] SPIPETHIANE
TypeSmall organic molecule
Emp. Form.C20H23NS
Mol. Mass.309.468
SMILESC(N1CCC2(CC1)CCc1ccccc1S2)c1ccccc1